{"text_format":"1","workbook":"xlsx","n_sheets":14,"sheets":["Hilfe","Erläuterung","Hochladen","1. Übersicht","2. Liste Betreuungspersonal","3a. Vorhalt Tag","3b. Vorhalt NachtWach","3c. Vorhalt NachtBereit","3d. Vorhalt Sonder Ruf-Bereit","4. TG-TS-TF","5. Gesamt","PK","Listen","Versionsverlauf"],"not_rendered":{"charts":0,"images":1,"macros":1,"external_links":0,"defined_names":177,"comments":6,"pivot_tables":0},"unopened":[],"bounds":{"document_bytes":16777216,"sheet_cells":100000,"rows_first":2000,"rows_last":500,"rows_between":2000,"halvings":0,"cell_chars":16384,"cell_head_chars":4096},"cells_cut":0,"cells_raw":0,"read":"whole","date_system":"1900"}

{"sheet":"Hilfe","index":0,"n_rows":1,"n_cols":1,"rows_kept":1,"cut":false,"hidden":false,"merged":[]}
["Wird fortlaufend Anhand von Rückmeldungen gepflegt werden:"]

{"sheet":"Erläuterung","index":1,"n_rows":18,"n_cols":1,"rows_kept":18,"cut":false,"hidden":false,"merged":[[1,0,2,0]]}
[]
["Das angegebene Personal ist mit den jeweiligen Stellenanteilen dem Betreuungspersonal zuzuordnen"]
[]
["Stellen in Vollzeitäquivalente (VZÄ)"]
["Diese Eingaben werden auf zwei Stellen nach dem Komma gerundet angegeben."]
["Vollzeitbeschäftigte sind Mitarbeiter, denen für das ganze Jahr die Vergütung für die tariflich oder einzelvertraglich vereinbarte Arbeitszeit für eine volle Stelle gezahlt wurde. Sie sind mit dem Wert 1,0 (volle Stelle) nachzuweisen. "]
["Fremdpersonal wird je nach Funktion (Betreuung, Leitung/Verwaltung, Wirtschhaftspersonal) entsprechend abgebildet. \nSoweit ein zeitlicher Umfang der Arbeit festgelegt ist, ergibt sich das VK-Äquivalent daraus und können die Kosten der Fremdbeauftragung entsprechend zugeordnet werden. (Rechenbeispiel: ...)\nWird ein Arbeitsergebnis vergütet, so ist das VK-Äquivalent anhand der Kosten der Fremdbeauftragung orientiert an den Kosten einer alternativ fest beschäftigten Kraft zu ermitteln. (Rechenbeispiel: ...)"]
["War für einen Mitarbeiter ein geringeres Jahresbrutto zu zahlen, als dies für eine Vollzeitbeschäftigung angefallen wäre, so ist er nur mit dem Vollzeitbeschäftigten-Bruchteil nachzuweisen, der dem Verhältnis seines tatsächlichen Beschäftigungsumfanges zu einer Vollzeitbeschäftigung entspricht (z.B. 0,5). Gründe hierfür können sein:"]
["- Teilzeitbeschäftigung,"]
["- Beginn oder Ende eines Arbeitsverhältnisses während des Betrachtungszeitraumes,"]
["- Im Krankheitsfalle während der Zeiten ohne Lohnfortzahlung,"]
["- Mutterschutzfrist und Mutterschaftsurlaub (Schwangerschaftsvertretungen sind gesondert zu erfassen)."]
["Stellen und Kosten (nach Abzug von Drittmitteln) für BFD, FSJ werden in V2 abgebildet.\nAuszubildende in der Betreuung werden beim Betreuungspersonal eingetragen."]
["Abbildung Zentralverwaltung/Fremdpersonal\n- Verteilungslogik mit dem Antrag schriftlich mitteilen\n- Personalkostenanteil Leitung/Verwaltung in 2a.; Rest in 2b. Zelle B37"]
[]
{"$rows_left_out":4}
{"sheet":"Hochladen","index":2,"n_rows":152,"n_cols":3,"rows_kept":152,"cut":false,"hidden":false,"merged":[[157,0,157,2],[151,2,153,2]]}
["Aktenzeichen LSJV: ",{"$f":"'1. Übersicht'!B1","v":0},"Übersicht"]
["Name des Angebots: ",{"$f":"'1. Übersicht'!B2","v":0},"Übersicht"]
["Träger des Angebots: ",{"$f":"'1. Übersicht'!B3","v":0},"Übersicht"]
["angewandter Tarif: ",{"$f":"'1. Übersicht'!B4","v":0},"Übersicht"]
["Name Ansprechpartner \nAnbieter: ",{"$f":"'1. Übersicht'!B5","v":0},"Übersicht"]
["Tel.: ",{"$f":"'1. Übersicht'!B6","v":0},"Übersicht"]
["e-mail: ",{"$f":"'1. Übersicht'!B7","v":0},"Übersicht"]
["Basisleistung nn",{"$f":"'1. Übersicht'!B16","v":0},"Übersicht"]
["Basisleistung nn EUR",{"$f":"'1. Übersicht'!C16","v":0},"Übersicht"]
["Basisleistung nn Satz",{"$f":"'1. Übersicht'!D16","v":0},"Übersicht"]
["Basisleistung nn VK",{"$f":"'1. Übersicht'!E16","v":0},"Übersicht"]
["Klienten: Anzahl",{"$f":"Klienten","v":0},"Gesamt"]
["Wochen: Anzahl",{"$f":"'5. Gesamt'!D9","v":0},"Gesamt"]
["Tage/Klient: p.a.",{"$f":"'5. Gesamt'!D10","v":0},"Gesamt"]
["Modul: ",{"$f":"Modul","v":"Wählen Sie das Modul aus. \nJe Modul ist eine gesonderte Datei zu erstellen!"},"Gesamt"]
{"$rows_left_out":138}
{"sheet":"1. Übersicht","index":3,"n_rows":39,"n_cols":10,"rows_kept":39,"cut":false,"hidden":false,"merged":[[0,6,2,8],[3,6,6,8],[27,0,33,0],[12,0,17,0],[8,0,9,0],[0,1,0,4],[1,1,1,4],[2,1,2,4],[27,2,27,4],[27,6,27,8],[8,6,8,8],[9,6,9,8],[3,1,3,4],[4,1,4,4],[5,1,5,4],[6,1,6,4]]}
["Aktenzeichen LSJV:",null,null,null,null,null,{"$f":"IF(B4=\"individuell\",\"Bitte geben Sie unten an aus welchen Gründen Sie mit individuellen Werten arbeiten:\",\"\")","v":""}]
["Name des Angebots:"]
["Träger des Angebots:"]
["angewandter Tarif:"]
["Name Ansprechpartner \nAnbieter:"]
["Tel.:"]
["e-mail:"]
[]
[null,"Plätze/Klienten:",{"$f":"Klienten","v":0},null,"Anzahl",null,{"$f":"'5. Gesamt'!G5","v":"Wählen Sie das Modul aus. \nJe Modul ist eine gesonderte Datei zu erstellen!"}]
[null,"Auslastung:",{"$f":"Auslastung","v":0.98499999999999999},null,"%",null,{"$f":"'5. Gesamt'!L5","v":"Bitte auswählen:"}]
[]
[null,null,"EUR","Satz","VK",null,"Phase 1","Phase 2","Plausi"]
["TS",{"$f":"\"Basisleistung \"&'5. Gesamt'!B16","v":"Basisleistung Bitte auswählen, wenn zutreffend oder eingeben."},{"$f":"'5. Gesamt'!C28","v":0},"TS",{"$f":"'5. Gesamt'!D26","v":0},null,{"$f":"C13*(Tage_nach_Auslastung*Klienten)","v":0},{"$f":"C13*(Tage_nach_Auslastung*Klienten)","v":0},{"$f":"'5. Gesamt'!I73","v":0}]
[null,{"$f":"\"Basisleistung \"&'5. Gesamt'!F16","v":"Basisleistung Bitte auswählen, wenn zutreffend oder eingeben."},{"$f":"'5. Gesamt'!G28","v":0},"TS",{"$f":"'5. Gesamt'!H26","v":0},null,{"$f":"C14*Tage_nach_Auslastung*Klienten","v":0},{"$f":"C14*Tage_nach_Auslastung*Klienten","v":0},{"$f":"'5. Gesamt'!I87","v":0}]
[null,{"$f":"\"Basisleistung \"&'5. Gesamt'!J16","v":"Basisleistung Bitte auswählen, wenn zutreffend oder eingeben."},{"$f":"'5. Gesamt'!K28","v":0},"TS",{"$f":"'5. Gesamt'!L26","v":0},null,{"$f":"C15*Tage_nach_Auslastung*Klienten","v":0},{"$f":"C15*Tage_nach_Auslastung*Klienten","v":0},{"$f":"'5. Gesamt'!I101","v":0}]
{"$rows_left_out":25}
{"sheet":"2. Liste Betreuungspersonal","index":4,"n_rows":500,"n_cols":34,"rows_kept":500,"cut":false,"hidden":false,"merged":[[3,6,3,17],[5,6,5,17],[5,21,5,33]]}
[null,null,null,null,null,null,"Q1a","Q1b","Q2","Q3","Q4","Summe"]
["Tarif\n- Auswahl -",{"$f":"'1. Übersicht'!B4:E4","v":0},0,0,0,null,{"$f":"(SUMIF(D8:D500,G1,S8:S500)/12)+(SUMIF(E8:E500,G1,S8:S500)/12)","v":0},{"$f":"(SUMIF(D8:D500,H1,S8:S500)/12)+(SUMIF(E8:E500,H1,S8:S500)/12)","v":0},{"$f":"(SUMIF(D8:D500,I1,S8:S500)/12)+(SUMIF(E8:E500,I1,S8:S500)/12)","v":0},{"$f":"(SUMIF(D8:D500,J1,S8:S500)/12)+(SUMIF(E8:E500,J1,S8:S500)/12)","v":0},{"$f":"(SUMIF(D8:D500,K1,S8:S500)/12)+(SUMIF(E8:E500,K1,S8:S500)/12)","v":0},{"$f":"SUM(G2:K2)","v":0}]
[]
[null,null,null,null,null,null,"Monate in denen die Vergütung gemäß angegebener Tätigkeit und Stellenanteil gezahlt wurde"]
["Stellen-/\nPersonalnr.\n\n- Eingabe -","\nTätigkeit/ Ausbildung\n\n- Auswahl -","Hauswirtschaft hier konkretisieren","Q-Gruppe\n\nKatalog-\ntätigkeiten","Q-Gruppe\n\n-Eingabe - ","Stellenanteil\n\n- Eingabe -","Juli\n2022","August\n2022","Sept.\n2022","Okt.\n2022","Nov.\n2022","Dez.\n2022","Januar\n2023","Feb.\n2023","März\n2023","April\n2023","Mai\n2023","Juni\n2023","Summe"]
["pseudonymisiert",null,null,null,null,null,null,null,null,null,null,null,null,null,null,null,null,null,null,null,null,"Berechnung der monatlichen Kapazität zur Darstellung in der Sparkline Zellen G6-R6"]
[null,null,null,null,null,null,{"$f":"V7","v":0},0,0,0,0,0,0,0,0,0,0,0,null,null,null,{"$f":"SUM(V8:V500)","v":0},0,0,0,0,0,0,0,0,0,0,0,0]
[null,null,null,{"$f":"IFERROR(INDEX(Listen!$B$1:$B$38,MATCH(B8,Listen!$A$1:$A$38,0),1),\"\")","v":""},null,null,null,null,null,null,null,null,null,null,null,null,null,null,{"$f":"SUM(G8:R8)*F8","v":0},{"$f":"S8","v":0},null,{"$f":"G8*F8","v":0},{"$f":"H8*F8","v":0},{"$f":"I8*F8","v":0},{"$f":"J8*F8","v":0},{"$f":"K8*F8","v":0},{"$f":"L8*F8","v":0},{"$f":"M8*F8","v":0},{"$f":"N8*F8","v":0},{"$f":"O8*F8","v":0},{"$f":"P8*F8","v":0},{"$f":"Q8*F8","v":0},{"$f":"R8*F8","v":0},{"$f":"S8*F8","v":0}]
[null,null,null,{"$f":"IFERROR(INDEX(Listen!$B$1:$B$38,MATCH(B9,Listen!$A$1:$A$38,0),1),\"\")","v":""},null,null,null,null,null,null,null,null,null,null,null,null,null,null,0,null,null,0,0,0,0,0,0,0,0,0,0,0,0,{"$f":"S9*F9","v":0}]
[null,null,null,{"$f":"IFERROR(INDEX(Listen!$B$1:$B$38,MATCH(B10,Listen!$A$1:$A$38,0),1),\"\")","v":""},null,null,null,null,null,null,null,null,null,null,null,null,null,null,0,null,null,0,0,0,0,0,0,0,0,0,0,0,0,0]
[null,null,null,{"$f":"IFERROR(INDEX(Listen!$B$1:$B$38,MATCH(B11,Listen!$A$1:$A$38,0),1),\"\")","v":""},null,null,null,null,null,null,null,null,null,null,null,null,null,null,0,null,null,0,0,0,0,0,0,0,0,0,0,0,0,0]
[null,null,null,{"$f":"IFERROR(INDEX(Listen!$B$1:$B$38,MATCH(B12,Listen!$A$1:$A$38,0),1),\"\")","v":""},null,null,null,null,null,null,null,null,null,null,null,null,null,null,0,null,null,0,0,0,0,0,0,0,0,0,0,0,0,0]
[null,null,null,{"$f":"IFERROR(INDEX(Listen!$B$1:$B$38,MATCH(B13,Listen!$A$1:$A$38,0),1),\"\")","v":""},null,null,null,null,null,null,null,null,null,null,null,null,null,null,0,null,null,0,0,0,0,0,0,0,0,0,0,0,0,0]
[null,null,null,{"$f":"IFERROR(INDEX(Listen!$B$1:$B$38,MATCH(B14,Listen!$A$1:$A$38,0),1),\"\")","v":""},null,null,null,null,null,null,null,null,null,null,null,null,null,null,0,null,null,0,0,0,0,0,0,0,0,0,0,0,0,0]
[null,null,null,{"$f":"IFERROR(INDEX(Listen!$B$1:$B$38,MATCH(B15,Listen!$A$1:$A$38,0),1),\"\")","v":""},null,null,null,null,null,null,null,null,null,null,null,null,null,null,0,null,null,0,0,0,0,0,0,0,0,0,0,0,0,0]
{"$rows_left_out":486}
{"sheet":"3a. Vorhalt Tag","index":5,"n_rows":70,"n_cols":11,"rows_kept":70,"cut":false,"hidden":false,"merged":[[17,3,17,9],[18,3,20,9],[0,0,0,9],[2,0,2,9],[15,0,15,9],[4,3,4,9],[5,3,7,9],[28,0,28,9],[30,3,30,9],[31,3,33,9],[41,0,41,9],[43,3,43,9],[44,3,46,9],[54,0,54,9],[56,3,56,9],[57,3,59,9],[67,0,67,9]]}
["Vorhalt Tagespräsenz"]
[]
["Schicht 1"]
[]
["h 1 VK p.a.:",1250,null,"Bitte Bedarf (Tage p.a. und Mitarbeiter je Schicht) kurz erläutern."]
["Tage p.a.:"]
["MA gleichzeitig in dieser Schicht:"]
["entspricht Schlüssel zu Klient:",{"$f":"\"1:\"&ROUND(Klienten/'3a. Vorhalt Tag'!B7,2)","v":{"$error":"#DIV/0!"}},"nach-\nrichtlich"]
[]
[null,"Mo","Di","Mi","Do","Fr","Sa","So","Summe"]
["von",null,null,null,null,null,null,null,null,"hh:mm",{"$f":"COUNTIF(B11:H11,\"<>\")","v":0}]
["bis",null,null,null,null,null,null,null,null,"hh:mm"]
["Stunden",{"$f":"B12-B11","v":"00:00:00"},{"$f":"C12-C11","v":"00:00:00"},"00:00:00","00:00:00","00:00:00","00:00:00","00:00:00",{"$f":"SUM(B13:H13)","v":0},"h/Woche"]
[null,null,null,null,null,null,null,null,{"$f":"IFERROR(ROUND(I13/K11*B6*24/B5,2)*B7,0)","v":0},"VK-Bedarf"]
[]
{"$rows_left_out":56}
{"sheet":"3b. Vorhalt NachtWach","index":6,"n_rows":32,"n_cols":11,"rows_kept":32,"cut":false,"hidden":false,"merged":[[18,3,20,9],[29,0,29,9],[0,0,0,9],[2,0,2,9],[4,3,4,9],[5,3,7,9],[15,0,15,9],[17,3,17,9]]}
["Vorhalt Nachtwache"]
[]
["Schicht 1"]
[]
["h 1 VK p.a.:",1250,null,"Bitte Bedarf (Tage p.a. und Mitarbeiter je Schicht) kurz erläutern."]
["Tage p.a.:"]
["MA gleichzeitig in dieser Schicht:"]
["entspricht Schlüssel zu Klient:",{"$f":"\"1:\"&ROUND(Klienten/'3b. Vorhalt NachtWach'!B7,2)","v":{"$error":"#DIV/0!"}},"nach-\nrichtlich"]
[]
[null,"Mo","Di","Mi","Do","Fr","Sa","So","Summe"]
["von",null,null,null,null,null,null,null,null,"hh:mm",{"$f":"COUNTIF(B11:H11,\"<>\")","v":0}]
["bis",null,null,null,null,null,null,null,null,"hh:mm"]
["Stunden",{"$f":"MOD(B12-B11,1)","v":"00:00:00"},{"$f":"MOD(C12-C11,1)","v":"00:00:00"},"00:00:00","00:00:00","00:00:00","00:00:00","00:00:00",{"$f":"SUM(B13:H13)","v":0},"h/Woche"]
[null,null,null,null,null,null,null,null,{"$f":"IFERROR(ROUND(I13/K11*$B$6*24/$B$5,2)*B7,0)","v":0},"VK-Bedarf"]
[]
{"$rows_left_out":18}
{"sheet":"3c. Vorhalt NachtBereit","index":7,"n_rows":34,"n_cols":11,"rows_kept":34,"cut":false,"hidden":false,"merged":[[18,3,18,9],[19,3,22,9],[31,0,31,9],[0,0,0,9],[2,0,2,9],[4,3,4,9],[5,3,8,9],[16,0,16,9]]}
["Vorhalt Nachtbereitschaft"]
[]
["Schicht 1"]
[]
["h 1 VK p.a.:",1250,null,"Bitte Bedarf (Tage p.a. und Mitarbeiter je Schicht) kurz erläutern."]
["Tage p.a.:"]
["MA je Schicht:"]
["entspricht Schlüssel zu Klient:",{"$f":"\"1:\"&ROUND(Klienten/'3c. Vorhalt NachtBereit'!B7,2)","v":{"$error":"#DIV/0!"}},"nach-\nrichtlich"]
["Berücksichtigung zu …%:",0.5,"höhere Werte tarif-\nindividuell verhandelbar"]
[]
[null,"Mo","Di","Mi","Do","Fr","Sa","So","Summe"]
["von",null,null,null,null,null,null,null,null,"hh:mm",{"$f":"COUNTIF(B12:H12,\"<>\")","v":0}]
["bis",null,null,null,null,null,null,null,null,"hh:mm"]
["Stunden",{"$f":"MOD(B13-B12,1)","v":"00:00:00"},{"$f":"MOD(C13-C12,1)","v":"00:00:00"},"00:00:00","00:00:00","00:00:00","00:00:00","00:00:00",{"$f":"SUM(B14:H14)","v":0},"h/Woche"]
[null,null,null,null,null,null,null,null,{"$f":"ROUND(I14/K12*Tage_pa*24/B5,2)*B7*B9","v":{"$error":"#DIV/0!"}},"VK-Bedarf"]
{"$rows_left_out":20}
{"sheet":"3d. Vorhalt Sonder Ruf-Bereit","index":8,"n_rows":34,"n_cols":11,"rows_kept":34,"cut":false,"hidden":false,"merged":[[19,3,22,9],[31,0,31,9],[0,0,0,9],[2,0,2,9],[4,3,4,9],[5,3,8,9],[16,0,16,9],[18,3,18,9]]}
["Sonderregelungen Ruf-Bereitschaft"]
[]
["Schicht 1"]
[]
["h 1 VK p.a.:",1250,null,"Bitte Bedarf (Tage p.a., Mitarbeiter je Schicht, %-Wert) kurz erläutern."]
["Tage p.a.:"]
["MA je Schicht:"]
["entspricht Schlüssel zu Klient:",{"$f":"\"1:\"&ROUND(Klienten/'3d. Vorhalt Sonder Ruf-Bereit'!B7,2)","v":{"$error":"#DIV/0!"}},"nach-\nrichtlich"]
["Berücksichtigung zu …%:"]
[]
[null,"Mo","Di","Mi","Do","Fr","Sa","So","Summe"]
["von",null,null,null,null,null,null,null,null,"hh:mm",{"$f":"COUNTIF(B12:H12,\"<>\")","v":0}]
["bis",null,null,null,null,null,null,null,null,"hh:mm"]
["Stunden",{"$f":"MOD(B13-B12,1)","v":"00:00:00"},{"$f":"MOD(C13-C12,1)","v":"00:00:00"},"00:00:00","00:00:00","00:00:00","00:00:00","00:00:00",{"$f":"SUM(B14:H14)","v":0},"h/Woche"]
[null,null,null,null,null,null,null,null,{"$f":"ROUND(I14/K12*Tage_pa*24/B5,2)*B7*B9","v":{"$error":"#DIV/0!"}},"VK-Bedarf"]
{"$rows_left_out":20}
{"sheet":"4. TG-TS-TF","index":9,"n_rows":13,"n_cols":11,"rows_kept":13,"cut":false,"hidden":false,"merged":[[0,0,0,9],[11,1,11,5],[4,2,5,2],[4,3,5,6]]}
["Tagesgruppe/-struktur/-förderung/-stätte"]
[]
["h 1 VK p.a.:",1250]
["Tage p.a.:"]
["Klienten je 1 VK:",null,{"$f":"B6/B5","v":{"$error":"#DIV/0!"}},{"$f":"\"VK-Bedarf bei \"&B6&\" Plätzen\"","v":"VK-Bedarf bei  Plätzen"}]
["Plätze"]
[]
[null,"Mo","Di","Mi","Do","Fr","Sa","So","Summe"]
["von"]
["bis"]
["Stunden",{"$f":"B10-B9","v":"00:00:00"},"00:00:00","00:00:00","00:00:00","00:00:00","00:00:00","00:00:00",{"$f":"SUM(B11:H11)","v":0},"h/Woche",{"$f":"COUNTIF(B11:F11,\"< 0,25\")","v":5}]
[null,{"$f":"IF(K11 > 0,\"Achtung!!! Die Öffnungszeit muss bei externer Tagestruktur an jedem Tag mindestens 6 h betragen!\",\"\")","v":"Achtung!!! Die Öffnungszeit muss bei externer Tagestruktur an jedem Tag mindestens 6 h betragen!"},null,null,null,null,null,"nach-\nrichtlich",{"$f":"Wochenstunden/5*Tage_p.a.*24/B3","v":0},"mindest VK-Bedarf \ngemäß Öffnungszeiten"]
[null,null,null,null,null,null,null,"nach-\nrichtlich",{"$f":"ROUND(I12*B5,0)","v":0},"max. Klienten \nbei mindest-VK"]

{"sheet":"5. Gesamt","index":10,"n_rows":120,"n_cols":14,"rows_kept":120,"cut":false,"hidden":false,"merged":[[91,13,98,13],[36,10,40,10],[77,13,84,13],[41,13,44,13],[48,1,48,11],[42,3,42,4],[46,1,46,11],[117,10,117,11],[116,6,116,7],[116,10,116,11],[107,5,107,8],[6,13,11,13],[53,4,53,6],[43,3,43,4],[44,3,45,4],[36,13,40,13],[104,6,104,7],[49,13,56,13],[63,13,70,13],[71,13,72,13],[88,1,88,11],[102,1,102,11],[36,4,40,4],[2,2,2,11],[0,2,0,11],[1,2,1,11],[20,13,24,13],[15,9,15,11],[4,2,4,3],[4,6,4,8],[13,1,13,11],[15,1,15,3],[15,5,15,7],[27,2,27,3],[27,6,27,7],[27,10,27,11],[117,6,117,7],[26,1,26,3],[26,5,26,7],[26,9,26,11],[29,1,29,11],[32,3,32,8],[58,1,58,11],[60,1,60,11],[74,1,74,11],[34,5,34,6],[55,4,55,6],[51,4,51,6],[52,4,52,6]]}
[null,"rötliche Felder: ","Standardwerte gemäß Vereinbarung der Parteien und teilweise regelmäßig (jährlich) anzupassen. Aufschläge V2 und I2 bei ambulant und bes WF 15%; bei TS/TF mindestens 15% und nach noch zu definierenden Standards auch höher möglich."]
[null,"gelbliche Felder:","Hier angebotsindividuelle Angaben/Einträge erforderlich\n"]
[null,null,"Bitte Kommentarbereich in der Spalte N beachten."]
[]
[null,"Tarifcluster:",{"$f":"'1. Übersicht'!B4","v":0},null,null,"Modul:","Wählen Sie das Modul aus. \nJe Modul ist eine gesonderte Datei zu erstellen!",null,null,null,"Abrechnung:","Bitte auswählen:"]
[null,null,null,null,null,{"$f":"IF(C5=PK!B4,PK!B5,IF(C5=PK!C4,PK!C5,IF(C5=PK!D4,PK!D5,IF(C5=PK!E4,PK!E5,IF(C5=PK!F4,PK!F5,IF(C5=PK!G4,PK!G5,IF(C5=PK!H4,PK!H5,IF(C5=PK!I4,PK!I5,IF(C5=PK!J4,PK!J5,IF(C5=PK!K4,PK!K5,IF(C5=PK!L4,PK!L5,IF(C5=PK!M4,PK!M5,PK!N4))))))))))))","v":"individuell"}]
[null,"1 VK p.a.:","h",1250,null,"1 VK p.a.","Q1a","Q1b","Q2","Q3","Q4",null,null,"Wenn Sie mit einem anderen Auslastungswert, als dem Standard-Auslastungs-Werte (Zelle D11) arbeiten wollen, so ist mit dem individuellen Kalkulationsschema zu verhandeln (andere Datei)"]
[null,"Klienten:","Anzahl",null,null,"EUR",{"$f":"INDIRECT($F$6&G7)","v":1},{"$f":"INDIRECT($F$6&H7)","v":2},{"$f":"INDIRECT($F$6&I7)","v":3},{"$f":"INDIRECT($F$6&J7)","v":4},{"$f":"INDIRECT($F$6&K7)","v":5}]
[null,"Wochen:","Anzahl",null,null,"VK",{"$f":"D68+D82+D96+D111","v":0},{"$f":"D69+D83+D97+D112","v":0},{"$f":"D70+D84+D98+D113","v":0},{"$f":"D71+D85+D99+D114","v":0},{"$f":"D72+D86+D100+D115","v":0},{"$f":"SUM(G9:K9)","v":0}]
[null,"Abrechnungstage/Klient:","p.a.",null,null,"VK Spanne",{"$f":"IFERROR(D37*E37,0)","v":0},{"$f":"D38*E38","v":0},{"$f":"D39*E39","v":0},{"$f":"D40*E40","v":0},{"$f":"D41*E41","v":0},{"$f":"SUM(G10:K10)","v":0}]
[null,"Auslastung",null,0.98499999999999999,null,"VK gesamt",{"$f":"G9+G10","v":0},{"$f":"H9+H10","v":0},{"$f":"I9+I10","v":0},{"$f":"J9+J10","v":0},{"$f":"K9+K10","v":0},{"$f":"SUM(G11:K11)","v":0}]
[null,"Abrechnungstage:","p.a.",{"$f":"D10*D11","v":0}]
[]
[null,"Pauschale Leistungen (=Basisleistung = Tagessatz)"]
[]
{"$rows_left_out":106}
{"sheet":"PK","index":11,"n_rows":24,"n_cols":14,"rows_kept":24,"cut":false,"hidden":false,"merged":[[17,1,17,13],[1,1,1,13]]}
[]
[null,"Werte durch Gemeinsame Kommission regelmäßig festzulegen.\n\n"]
[null,"2024-01-01","2024-11-01","2024-11-01","2024-06-01","2024-11-01","2024-06-01","2024-03-01","2024-03-01","2024-03-01","2024-07-01","2024-09-01","2025-01-01"]
["Wählen Sie hier den für Sie geltenden Tarif aus!","nicht\ntarifgebundene\nAnbieter *","AWO \nTVL-E","LKH /\nAWO\nTVL-S/E mix","AWO","AWO\nTVL-S","DRK","BAT KF","TVöD","Caritas","Diakonie\nAVR DD /\nJohanniter","Diakonie \nAVR HN","Paritäter","individuell"]
[null,"nicht_tarifgebundene_Anbieter","AWO_TVLE","LKH_AWO_TVLSEmix","AWO","AWO_TVLS","DRK","BAT_KF","TVöD","Caritas","DiakonieAVRDD_Johanniter","Diakonie_AVR_HN","Paritäter","individuell"]
["Q1a",62540.227177874629,65769.178136932052,69960.254131181777,73155.52384290818,69960.254131181777,78549.239486349354,77475.966480357529,79443.479551215496,80989.998022107713,80740.546705683271,83603.675541800403,73268,1]
["Q1b",57434.386865503642,60935.135717529898,63815.985406115156,67247.006242817413,63815.985406115156,71900.764260648473,71042.708462433016,72783.820667497275,75650.323621626332,70612.966594488855,73715.843484366822,70769,2]
["Q2",55307.187351966466,59866.098248801303,62804.131617998275,66126.222805437137,62752.385649346579,71900.764260648473,71042.708462433016,72783.820667497275,74504.106597056234,69492.125854893791,72545.750730646716,70769,3]
["Q3",47211.304586651997,50545.676993708308,52099.285181297564,54740.829175935018,53649.209757559081,60791.67749721968,59908.008561997922,61540.243252998349,60087.329569727393,57191.220583192313,60055.063237735514,56940,4]
["Q4",36711.074407903121,41030.024338244664,41030.024338244664,43103.020465450565,43189.499303415447,53005.735417519667,52379.528228532836,53664.166982999071,50068.436391179588,48220.048727005284,51244.335280913801,46124,5]
[]
[]
[null,"Die Werte gelten ab dem in Zeile 3 angegebenen Datum."]
[null,"Die Personalnebenkosten nach § 14 Abs. 3 LRV werden in den Aufschlägen Leitung/Verwaltung und Sachkosten/Investkosten berücksichtigt"]
[null,"*Anbieter, die nicht § 31 Abs. 2 LRV anwenden"]
{"$rows_left_out":10}
{"sheet":"Listen","index":12,"n_rows":33,"n_cols":9,"rows_kept":33,"cut":false,"hidden":false,"merged":[]}
["Sozialarbeiter:in (Diplom/Master/Bachelor)","Q1a","Reinigungskraft",null,"Bitte auswählen, wenn zutreffend oder eingeben.",null,"Wählen Sie das Modul aus. \nJe Modul ist eine gesonderte Datei zu erstellen!",null,"Bitte auswählen:"]
["Sozialpädagog:in (Diplom/Master/Bachelor)","Q1a","Hausmeister:in",null,"Tagesstruktur/-gruppe/-stätte",null,"1.     Tagesstruktur",null,"Tagessatz"]
["Pädagog:in (Diplom/Master/Bachelor)","Q1a","Koch/Köchin",null,"Präsenz am Tag",null,"2.     Teilhabe in der eigenen Wohnung und anderen Wohnformen innerhalb und außerhalb von besonderen Wohnformen",null,"Fachleistungsstundensatz"]
["Erziehungswissenschaftler:in (Diplom/Master/Bachelor)","Q1a","Gärtner:in",null,"Präsenz Nachtwache",null,"3.     Teilhabe im Sozialraum"]
["Heilpädagogen (Diplom/Master/Bachelor)","Q1a",null,null,"Präsenz Nachtbereitschaft",null,"4.     zusätzliche spezielle Bedarfslagen"]
["Ergotherapeuten ((Diplom/Master/Bachelor)","Q1a",null,null,"Sonderregelungen Ruf-Bereitschaft"]
["Psycholog:in (Diplom/Master/Bachelor)","Q1a"]
["Ärztin/Arzt (Examen)","Q1a"]
["sonst. fachspezifisch Diplom/Master/Bachelor","Q1a"]
[]
["Heilpädagog:innen (3 Jahre)","Q1b"]
["Erzieher:innen (3 Jahre)","Q1b"]
["Ergotherapeut:innen (3 Jahre)","Q1b"]
["Heilerziehungspfleger:innen (3 Jahre)","Q1b"]
["sonst. fachspezifische Ausbildung (3 Jahre)","Q1b"]
{"$rows_left_out":19}
{"sheet":"Versionsverlauf","index":13,"n_rows":28,"n_cols":4,"rows_kept":28,"cut":false,"hidden":false,"merged":[]}
["Versionsverlauf:"]
[]
[null,"Blatt","Zellen"]
["2.2","3a.",null,"Auf 5 Schichten erweitert"]
["2.2","5. Gesamt","Zelle B12","\"Abrechnungstage\" statt \"Tage/Klient\""]
["2.2","6. Gesamt","Zelle N42","Plausibilitätsprüfung"]
["2.2","PK","Tarife","BAT KF und TVöD jetzt getrennt abgebildet"]
["2.3","2.","G5-R5","Zellschutz entfernt"]
["2.3","5. Gesamt","N32","Fehlermeldung überarbeitet (IST-IST-Abgleich, statt vorher IST-SOLL-Abgleich)"]
["2.3","3a.",null,"Summenbildung korrigiert"]
["2.3","5. Gesamt","B10","Text geändert von Tage auf Abrechnungstage"]
["2.4","2. ","F2-J2","Formeln (unerklärlicher Fehler; manuell eingegebene Q-Gruppen nicht berücksichtigt) überarbeitet"]
["2.4","2. ","ab A215","Eingabemöglichkeit um weitere Zeilen ergänzt"]
["2.4","2. ","V6-AH17","Berechnung der monatlichen Kapazität zur Darstellung in der Sparkline Zellen G6-R366 (war ursprünglich enthalten und dann im Laufe der Entwicklung der Tabelle \"verloren\" gegangen)"]
["2.4","1. Übersicht","Zelle B22","Text konkretisiert"]
{"$rows_left_out":13}